goocanvas error in fedora core

classic Classic list List threaded Threaded
2 messages Options
Reply | Threaded
Open this post in threaded view
|

goocanvas error in fedora core

Gonzalo Odiard-2
Today have the following error:

make[3]: Entering directory
`/home/gonzalo/EsperandoOLPC/sugar/sugar-jhbuild/source/goocanvas/src'
if /bin/sh ../libtool --tag=CC --mode=compile gcc -DHAVE_CONFIG_H -I. -I.
-I.. -DG_DISABLE_DEPRECATED -DPANGO_DISABLE_DEPRECATED
-DGDK_DISABLE_DEPRECATED -DGDK_PIXBUF_DISABLE_DEPRECATED
-DGTK_DISABLE_DEPRECATED
-DPACKAGE_DATA_DIR=\""/home/gonzalo/EsperandoOLPC/sugar/sugar-jhbuild/build/share"\"
-DPACKAGE_LOCALE_DIR=\""/home/gonzalo/EsperandoOLPC/sugar/sugar-jhbuild/build/share/locale"\"
-DG_LOG_DOMAIN=\"GooCanvas\"
-I/home/gonzalo/EsperandoOLPC/sugar/sugar-jhbuild/build/include/cairo
-I/usr/include/gtk-2.0 -I/usr/lib/gtk-2.0/include
-I/usr/include/atk-1.0-I/usr/include/pango-
1.0 -I/usr/include/cairo -I/usr/include/glib-2.0
-I/usr/lib/glib-2.0/include
-g -O2 -MT goocanvasatk.lo -MD -MP -MF ".deps/goocanvasatk.Tpo" -c -o
goocanvasatk.lo goocanvasatk.c; \
then mv -f ".deps/goocanvasatk.Tpo" ".deps/goocanvasatk.Plo"; else rm -f
".deps/goocanvasatk.Tpo"; exit 1; fi
 gcc -DHAVE_CONFIG_H -I. -I. -I.. -DG_DISABLE_DEPRECATED
-DPANGO_DISABLE_DEPRECATED -DGDK_DISABLE_DEPRECATED
-DGDK_PIXBUF_DISABLE_DEPRECATED -DGTK_DISABLE_DEPRECATED
-DPACKAGE_DATA_DIR=\"/home/gonzalo/EsperandoOLPC/sugar/sugar-jhbuild/build/share\"
-DPACKAGE_LOCALE_DIR=\"/home/gonzalo/EsperandoOLPC/sugar/sugar-jhbuild/build/share/locale\"
-DG_LOG_DOMAIN=\"GooCanvas\"
-I/home/gonzalo/EsperandoOLPC/sugar/sugar-jhbuild/build/include/cairo
-I/usr/include/gtk-2.0 -I/usr/lib/gtk-2.0/include
-I/usr/include/atk-1.0-I/usr/include/pango-
1.0 -I/usr/include/cairo -I/usr/include/glib-2.0 -I/usr/lib/glib-2.0/include
-g -O2 -MT goocanvasatk.lo -MD -MP -MF .deps/goocanvasatk.Tpo -c
goocanvasatk.c  -fPIC -DPIC -o .libs/goocanvasatk.o
In file included from goocanvas.h:30,
                 from goocanvasatk.c:13:
./goocanvasview.h:106: error: expected specifier-qualifier-list before
'GtkUnit'
make[3]: *** [goocanvasatk.lo] Error 1
make[3]: Leaving directory
`/home/gonzalo/EsperandoOLPC/sugar/sugar-jhbuild/source/goocanvas/src'
make[2]: *** [all] Error 2
make[2]: Leaving directory
`/home/gonzalo/EsperandoOLPC/sugar/sugar-jhbuild/source/goocanvas/src'
make[1]: *** [all-recursive] Error 1
make[1]: Leaving directory
`/home/gonzalo/EsperandoOLPC/sugar/sugar-jhbuild/source/goocanvas'
make: *** [all] Error 2
-------------- next part --------------
An HTML attachment was scrubbed...
URL: http://mailman.laptop.org/pipermail/sugar/attachments/20060901/4150b141/attachment.html
Reply | Threaded
Open this post in threaded view
|

goocanvas error in fedora core

Marco Pesenti Gritti
Gonzalo Odiard wrote:

> Today have the following error:
>
> make[3]: Entering directory
> `/home/gonzalo/EsperandoOLPC/sugar/sugar-jhbuild/source/goocanvas/src'
> if /bin/sh ../libtool --tag=CC --mode=compile gcc -DHAVE_CONFIG_H -I.
> -I. -I.. -DG_DISABLE_DEPRECATED -DPANGO_DISABLE_DEPRECATED
> -DGDK_DISABLE_DEPRECATED -DGDK_PIXBUF_DISABLE_DEPRECATED
> -DGTK_DISABLE_DEPRECATED
> -DPACKAGE_DATA_DIR=\""/home/gonzalo/EsperandoOLPC/sugar/sugar-jhbuild/build/share"\"
> -DPACKAGE_LOCALE_DIR=\""/home/gonzalo/EsperandoOLPC/sugar/sugar-jhbuild/build/share/locale"\"
> -DG_LOG_DOMAIN=\"GooCanvas\"
> -I/home/gonzalo/EsperandoOLPC/sugar/sugar-jhbuild/build/include/cairo
> -I/usr/include/gtk- 2.0 -I/usr/lib/gtk-2.0/include
> -I/usr/include/atk-1.0 -I/usr/include/pango-1.0 -I/usr/include/cairo
> -I/usr/include/glib-2.0 -I/usr/lib/glib-2.0/include      -g -O2 -MT
> goocanvasatk.lo -MD -MP -MF ".deps/goocanvasatk.Tpo" -c -o
> goocanvasatk.lo goocanvasatk.c; \
> then mv -f ".deps/goocanvasatk.Tpo" ".deps/goocanvasatk.Plo"; else rm
> -f ".deps/goocanvasatk.Tpo"; exit 1; fi
>  gcc -DHAVE_CONFIG_H -I. -I. -I.. -DG_DISABLE_DEPRECATED
> -DPANGO_DISABLE_DEPRECATED -DGDK_DISABLE_DEPRECATED
> -DGDK_PIXBUF_DISABLE_DEPRECATED -DGTK_DISABLE_DEPRECATED
> -DPACKAGE_DATA_DIR=\"/home/gonzalo/EsperandoOLPC/sugar/sugar-jhbuild/build/share\"
> -DPACKAGE_LOCALE_DIR=\"/home/gonzalo/EsperandoOLPC/sugar/sugar-jhbuild/build/share/locale\"
> -DG_LOG_DOMAIN=\"GooCanvas\"
> -I/home/gonzalo/EsperandoOLPC/sugar/sugar-jhbuild/build/include/cairo
> -I/usr/include/gtk- 2.0 -I/usr/lib/gtk-2.0/include
> -I/usr/include/atk-1.0 -I/usr/include/pango-1.0 -I/usr/include/cairo
> -I/usr/include/glib-2.0 -I/usr/lib/glib-2.0/include -g -O2 -MT
> goocanvasatk.lo -MD -MP -MF .deps/goocanvasatk.Tpo -c goocanvasatk.c  
> -fPIC -DPIC -o .libs/goocanvasatk.o
> In file included from goocanvas.h:30,
>                  from goocanvasatk.c:13:
> ./goocanvasview.h:106: error: expected specifier-qualifier-list before
> 'GtkUnit'
> make[3]: *** [ goocanvasatk.lo] Error 1
> make[3]: Leaving directory
> `/home/gonzalo/EsperandoOLPC/sugar/sugar-jhbuild/source/goocanvas/src'
> make[2]: *** [all] Error 2
> make[2]: Leaving directory
> `/home/gonzalo/EsperandoOLPC/sugar/sugar-jhbuild/source/goocanvas/src'
> make[1]: *** [all-recursive] Error 1
> make[1]: Leaving directory
> `/home/gonzalo/EsperandoOLPC/sugar/sugar-jhbuild/source/goocanvas'
> make: *** [all] Error 2

Yeah, goocanvas now depends on gtk 2.10 :/ I need to make sugar-jhbuild
build it when not available on the system or something. I'll let you know.

Marco